Page 2 of 3 FirstFirst 123 LastLast
Results 16 to 30 of 38

Thread: MythTivo now available

  1. #16
    Join Date
    Jan 2005
    Posts
    2

    MythTV

    This is probably a stupid question and Im going to keep searching for the answer while I wait to see if someone answers it. I am trying to configure MythTV I am in gentoo and just did a 'emerge mythtv' to get it installed however as I go through the documentation on installing it it wants you to setup tv tuner cards and such which if you are using it as a PVR as one might assume would be helpful however I just wanted to use it for MythTiVo so is there some magic way to get it working without going through and setting up a TV tuner?

    -Matt

  2. #17
    Join Date
    Aug 2006
    Posts
    1
    Anyone have this working w/ mythtv .20?

  3. #18
    Join Date
    Feb 2002
    Posts
    285
    Quote Originally Posted by LoOoD View Post
    Anyone have this working w/ mythtv .20?
    I'm still trying to upgrade to 0.20 on my Gentoo Mythbox, but 0.19 compiled just fine, so I'm sure that 0.20 will work as well. If you don't want to compile a special mplayer, you can use the patch that I posted elsewhere to use mfs_ftp instead of vserver for getting the feed into mplayer (search the forums, it's around somewhere).

    UPDATE - Yes, MythTivo does compile and run just fine on 0.20. I had to define __NR__llseek in util.c in order to get it to compile, but I don't know if that was because of my Gentoo environment or what. Regardless, it runs just fine. If it doesn't compile and you get an error message about __NR_llseek, try adding these lines to util.c:

    #ifndef __NR__llseek
    #define __NR__llseek 140
    #endif
    Last edited by stealthdave; 10-29-2006 at 08:11 PM. Reason: compiled on 0.20
    - Stealth Dave

  4. #19
    Join Date
    Oct 2004
    Posts
    87

    Error 2 When Compling

    I'm using ubuntu and myth .20, but I get an error when compling
    Error processing project file: /home/myth/Desktop/mythtivo/mythvideo/mythvideo.pro

    Could you point me in the right direction I installed mythvideo but have not tested it yet, but I did install mythvideo which was already compiled.

  5. #20
    Join Date
    Feb 2004
    Posts
    54

    runing make on fedora 5

    ok I have tried and tried but no luck, i download then run the tar command like it said. but when i run the make command from the mythtivo dir i get this error.

    [root@amontpellier-257-1-113-6 mythtivo]# make
    make: *** No rule to make target `/mkspecs/linux-g++/qmake.conf', needed by `Makefile'. Stop.

    can someone tell me what i'm doing wrong. tried it on rh9 fc4 fc5 get the same thing
    5 Hughes Dtivo all running 6.2 and hacked

  6. #21
    Join Date
    Feb 2004
    Posts
    54

    fixed one problem but have new part 1

    well i can run make now but get the following list of errors. any one have any idea

    [root@amontpellier-257-1-113-6 mythtivo]# make
    cd mythtivo && qmake -o Makefile
    cd mythtivo && make -f Makefile
    make[1]: Entering directory `/home/mythtv/mythtivo/mythtivo'
    gcc -c -pipe -Wall -W -O3 -march=pentiumpro -fomit-frame-pointer -D_REENTRANT -fPIC -D_GNU_SOURCE -DPREFIX=\"/usr/local\" -DQT_NO_DEBUG -DQT_THREAD_SUPPORT -DQT_PLUGIN -I/usr/lib/qt-3.3/mkspecs/default -I. -I/usr/local/include -I/include -o bitmap.o bitmap.c
    bitmap.c: In function ‘bitmap_set’:
    bitmap.c:31: warning: comparison between signed and unsigned
    gcc -c -pipe -Wall -W -O3 -march=pentiumpro -fomit-frame-pointer -D_REENTRANT -fPIC -D_GNU_SOURCE -DPREFIX=\"/usr/local\" -DQT_NO_DEBUG -DQT_THREAD_SUPPORT -DQT_PLUGIN -I/usr/lib/qt-3.3
    5 Hughes Dtivo all running 6.2 and hacked

  7. #22
    Join Date
    Feb 2004
    Posts
    54

    part 2

    /mkspecs/default -I. -I/usr/local/include -I/include -o crc.o crc.c
    gcc -c -pipe -Wall -W -O3 -march=pentiumpro -fomit-frame-pointer -D_REENTRANT -fPIC -D_GNU_SOURCE -DPREFIX=\"/usr/local\" -DQT_NO_DEBUG -DQT_THREAD_SUPPORT -DQT_PLUGIN -I/usr/lib/qt-3.3/mkspecs/default -I. -I/usr/local/include -I/include -o export.o export.c
    gcc -c -pipe -Wall -W -O3 -march=pentiumpro -fomit-frame-pointer -D_REENTRANT -fPIC -D_GNU_SOURCE -DPREFIX=\"/usr/local\" -DQT_NO_DEBUG -DQT_THREAD_SUPPORT -DQT_PLUGIN -I/usr/lib/qt-3.3/mkspecs/default -I. -I/usr/local/include -I/include -o io.o io.c
    io.c: In function ‘vserver_read_sectors’:
    io.c:93: warning: comparison between signed and unsigned
    io.c: In function ‘mfs_read_sectors’:
    io.c:167: warning: comparison between signed and unsigned
    gcc -c -pipe -Wall -W -O3 -march=pentiumpro -fomit-frame-pointer -D_REENTRANT -fPIC -D_GNU_SOURCE -DPREFIX=\"/usr/local\" -DQT_NO_DEBUG -DQT_THREAD_SUPPORT -DQT_PLUGIN -I/usr/lib/qt-3.3/mkspecs/default -I. -I/usr/local/include -I/include -o mfs.o mfs.c
    mfs.c: In function ‘mfs_load_inode’:
    mfs.c:181: warning: comparison between signed and unsigned
    mfs.c:194: warning: comparison between signed and unsigned
    mfs.c:196: warning: comparison between signed and unsigned
    mfs.c: In function ‘mfs_fsid_info’:
    mfs.c:266: warning: comparison between signed and unsigned
    mfs.c: In function ‘mfs_fsid_pread’:
    mfs.c:317: warning: comparison between signed and unsigned
    mfs.c:321: warning: comparison between signed and unsigned
    mfs.c:323: warning: comparison between signed and unsigned
    mfs.c: In function ‘mfs_dir’:
    mfs.c:394: warning: pointer targets in initialization differ in signedness
    mfs.c:401: warning: pointer targets in initialization differ in signedness
    mfs.c:402: warning: pointer targets in passing argument 1 of ‘strlen’ differ in signedness
    mfs.c:402: warning: pointer targets in passing argument 1 of ‘__strdup’ differ in signedness
    mfs.c:428: warning: pointer targets in passing argument 2 of ‘mfs_dir’ differ in signedness
    mfs.c: In function ‘mfs_resolve’:
    mfs.c:496: warning: comparison between signed and unsigned
    mfs.c:499: warning: comparison between signed and unsigned
    mfs.c: In function ‘mfs_all_inodes’:
    mfs.c:532: warning: comparison between signed and unsigned
    mfs.c: In function ‘bitmap_fn’:
    mfs.c:568: warning: comparison between signed and unsigned
    mfs.c: In function ‘mfs_read_chunk’:
    mfs.c:669: warning: comparison between signed and unsigned
    mfs.c:673: warning: comparison between signed and unsigned
    mfs.c:673: warning: comparison between signed and unsigned
    mfs.c: In function ‘mfs_get_attribute’:
    mfs.c:722: warning: pointer targets in assignment differ in signedness
    mfs.c:723: warning: pointer targets in assignment differ in signedness
    mfs.c:759: warning: pointer targets in passing argument 1 of ‘strlen’ differ in signedness
    mfs.c:759: warning: pointer targets in passing argument 2 of ‘strcpy’ differ in signedness
    mfs.c:760: warning: pointer targets in passing argument 1 of ‘strlen’ differ in signedness
    mfs.c:769: warning: pointer targets in assignment differ in signedness
    gcc -c -pipe -Wall -W -O3 -march=pentiumpro -fomit-frame-pointer -D_REENTRANT -fPIC -D_GNU_SOURCE -DPREFIX=\"/usr/local\" -DQT_NO_DEBUG -DQT_THREAD_SUPPORT -DQT_PLUGIN -I/usr/lib/qt-3.3/mkspecs/default -I. -I/usr/local/include -I/include -o object.o object.c
    object.c: In function ‘parse_attr’:
    object.c:9: warning: unused parameter ‘obj_type’
    gcc -c -pipe -Wall -W -O3 -march=pentiumpro -fomit-frame-pointer -D_REENTRANT -fPIC -D_GNU_SOURCE -DPREFIX=\"/usr/local\" -DQT_NO_DEBUG -DQT_THREAD_SUPPORT -DQT_PLUGIN -I/usr/lib/qt-3.3/mkspecs/default -I. -I/usr/local/include -I/include -o partition.o partition.c
    gcc -c -pipe -Wall -W -O3 -march=pentiumpro -fomit-frame-pointer -D_REENTRANT -fPIC -D_GNU_SOURCE -DPREFIX=\"/usr/local\" -DQT_NO_DEBUG -DQT_THREAD_SUPPORT -DQT_PLUGIN -I/usr/lib/qt-3.3/mkspecs/default -I. -I/usr/local/include -I/include -o query.o query.c
    query.c: In function ‘callback’:
    query.c:43: warning: comparison between signed and unsigned
    query.c: In function ‘query_part’:
    query.c:39: warning: unused parameter ‘fsid’
    query.c: At top level:
    query.c:28: warning: ‘memdup’ defined but not used
    gcc -c -pipe -Wall -W -O3 -march=pentiumpro -fomit-frame-pointer -D_REENTRANT -fPIC -D_GNU_SOURCE -DPREFIX=\"/usr/local\" -DQT_NO_DEBUG -DQT_THREAD_SUPPORT -DQT_PLUGIN -I/usr/lib/qt-3.3/mkspecs/default -I. -I/usr/local/include -I/include -o schema.o schema.c
    schema.c: In function ‘preload_schema’:
    schema.c:85: warning: comparison between signed and unsigned
    schema.c:43: warning: unused parameter ‘fname’
    schema.c: In function ‘load_schema’:
    schema.c:151: warning: unused parameter ‘fsid’
    schema.c:167: warning: unused parameter ‘fsid’
    schema.c: In function ‘dump_schema’:
    schema.c:246: warning: unused parameter ‘f’
    gcc -c -pipe -Wall -W -O3 -march=pentiumpro -fomit-frame-pointer -D_REENTRANT -fPIC -D_GNU_SOURCE -DPREFIX=\"/usr/local\" -DQT_NO_DEBUG -DQT_THREAD_SUPPORT -DQT_PLUGIN -I/usr/lib/qt-3.3/mkspecs/default -I. -I/usr/local/include -I/include -o util.o util.c
    g++ -c -pipe -Wall -W -O3 -march=pentiumpro -fomit-frame-pointer -D_REENTRANT -fPIC -D_GNU_SOURCE -DPREFIX=\"/usr/local\" -DQT_NO_DEBUG -DQT_THREAD_SUPPORT -DQT_PLUGIN -I/usr/lib/qt-3.3/mkspecs/default -I. -I/usr/local/include -I/include -o main.o main.cpp
    main.cpp:1:18: error: qdir.h: No such file or directory
    main.cpp:5:26: error: qapplication.h: No such file or directory
    main.cpp:6:26: error: qsqldatabase.h: No such file or directory
    main.cpp:8:29: error: qsocketnotifier.h: No such file or directory
    In file included from main.cpp:17:
    metadata.h:4:21: error: qstring.h: No such file or directory
    In file included from main.cpp:18:
    databasebox.h:4:21: error: qwidget.h: No such file or directory
    databasebox.h:5:21: error: qdialog.h: No such file or directory
    databasebox.h:6:25: error: qstringlist.h: No such file or directory
    databasebox.h:9:32: error: mythtv/mythwidgets.h: No such file or directory
    databasebox.h:10:32: error: mythtv/mythdialogs.h: No such file or directory
    main.cpp:20:31: error: mythtv/themedmenu.h: No such file or directory
    main.cpp:21:32: error: mythtv/mythcontext.h: No such file or directory
    main.cpp:23:31: error: mythtv/mythplugin.h: No such file or directory
    metadata.h:13: error: expected `)' before ‘ldate’
    metadata.h:59: error: ‘QString’ does not name a type
    metadata.h:60: error: expected ‘,’ or ‘...’ before ‘&’ token
    metadata.h:60: error: ISO C++ forbids declaration of ‘QString’ with no type
    metadata.h:62: error: ‘QString’ does not name a type
    5 Hughes Dtivo all running 6.2 and hacked

  8. #23
    Join Date
    Feb 2004
    Posts
    54

    part 3

    metadata.h:63: error: expected ‘,’ or ‘...’ before ‘&’ token
    metadata.h:63: error: ISO C++ forbids declaration of ‘QString’ with no type
    metadata.h:65: error: ‘QString’ does not name a type
    metadata.h:66: error: expected ‘,’ or ‘...’ before ‘&’ token
    metadata.h:66: error: ISO C++ forbids declaration of ‘QString’ with no type
    metadata.h:68: error: ‘QString’ does not name a type
    metadata.h:69: error: expected ‘,’ or ‘...’ before ‘&’ token
    metadata.h:69: error: ISO C++ forbids declaration of ‘QString’ with no type
    metadata.h:71: error: ‘QString’ does not name a type
    metadata.h:72: error: expected ‘,’ or ‘...’ before ‘&’ token
    metadata.h:72: error: ISO C++ forbids declaration of ‘QString’ with no type
    metadata.h:74: error: ‘QString’ does not name a type
    metadata.h:75: error: expected ‘,’ or ‘...’ before ‘&’ token
    metadata.h:75: error: ISO C++ forbids declaration of ‘QString’ with no type
    metadata.h:97: error: ‘QString’ does not name a type
    metadata.h:98: error: ‘QString’ does not name a type
    metadata.h:99: error: ‘QString’ does not name a type
    metadata.h:100: error: ‘QString’ does not name a type
    metadata.h:101: error: ‘QString’ does not name a type
    metadata.h:102: error: ‘QString’ does not name a type
    metadata.h: In copy constructor ‘Metadata::Metadata(const Metadata&)’:
    metadata.h:43: error: ‘date’ was not declared in this scope
    metadata.h:43: error: ‘const class Metadata’ has no member named ‘date’
    metadata.h:44: error: ‘const class Metadata’ has no member named ‘time’
    metadata.h:45: error: ‘title’ was not declared in this scope
    metadata.h:45: error: ‘const class Metadata’ has no member named ‘title’
    metadata.h:46: error: ‘episode’ was not declared in this scope
    metadata.h:46: error: ‘const class Metadata’ has no member named ‘episode’
    metadata.h:47: error: ‘callsign’ was not declared in this scope
    metadata.h:47: error: ‘const class Metadata’ has no member named ‘callsign’
    metadata.h:48: error: ‘tivo’ was not declared in this scope
    metadata.h:48: error: ‘const class Metadata’ has no member named ‘tivo’
    metadata.h: In member function ‘void Metadata::setDate(int)’:
    metadata.h:60: error: ‘date’ was not declared in this scope
    metadata.h:60: error: ‘ldate’ was not declared in this scope
    metadata.h: At global scope:
    metadata.h:60: warning: unused parameter ‘QString’
    metadata.h: In member function ‘void Metadata::setTime(int)’:
    metadata.h:63: error: ‘ltime’ was not declared in this scope
    metadata.h: At global scope:
    metadata.h:63: warning: unused parameter ‘QString’
    metadata.h: In member function ‘void Metadata::setTitle(int)’:
    metadata.h:66: error: ‘title’ was not declared in this scope
    metadata.h:66: error: ‘ltitle’ was not declared in this scope
    metadata.h: At global scope:
    metadata.h:66: warning: unused parameter ‘QString’
    metadata.h: In member function ‘void Metadata::setEpisode(int)’:
    metadata.h:69: error: ‘episode’ was not declared in this scope
    metadata.h:69: error: ‘lepisode’ was not declared in this scope
    metadata.h: At global scope:
    metadata.h:69: warning: unused parameter ‘QString’
    metadata.h: In member function ‘void Metadata::setCallsign(int)’:
    metadata.h:72: error: ‘callsign’ was not declared in this scope
    metadata.h:72: error: ‘lcallsign’ was not declared in this scope
    metadata.h: At global scope:
    metadata.h:72: warning: unused parameter ‘QString’
    metadata.h: In member function ‘void Metadata::setTivo(int)’:
    metadata.h:75: error: ‘tivo’ was not declared in this scope
    metadata.h:75: error: ‘ltivo’ was not declared in this scope
    metadata.h: At global scope:
    metadata.h:75: warning: unused parameter ‘QString’
    databasebox.h:19: error: expected class-name before ‘{’ token
    databasebox.h:20: error: ISO C++ forbids declaration of ‘Q_OBJECT’ with no type
    databasebox.h:22: error: expected ‘;’ before ‘public’
    databasebox.h:27: error: expected `;' before ‘protected’
    databasebox.h:27: error: expected `:' before ‘slots’
    databasebox.h:28: error: expected primary-expression before ‘void’
    databasebox.h:28: error: ISO C++ forbids declaration of ‘slots’ with no type
    databasebox.h:28: error: expected ‘;’ before ‘void’
    databasebox.h:32: error: expected class-name before ‘{’ token
    databasebox.h:33: error: ISO C++ forbids declaration of ‘Q_OBJECT’ with no type
    databasebox.h:34: error: expected ‘;’ before ‘public’
    databasebox.h:38: error: expected `:' before ‘slots’
    databasebox.h:39: error: expected primary-expression before ‘void’
    databasebox.h:39: error: ISO C++ forbids declaration of ‘slots’ with no type
    databasebox.h:39: error: expected ‘;’ before ‘void’
    databasebox.h:42: error: expected `:' before ‘slots’
    databasebox.h:43: error: expected primary-expression before ‘void’
    databasebox.h:43: error: ISO C++ forbids declaration of ‘slots’ with no type
    databasebox.h:43: error: expected ‘;’ before ‘void’
    databasebox.h:47: error: ‘QValueList’ has not been declared
    databasebox.h:47: error: expected ‘,’ or ‘...’ before ‘<’ token
    databasebox.h:49: error: ‘QPixmap’ does not name a type
    databasebox.h:55: error: ISO C++ forbids declaration of ‘QValueList’ with no type
    databasebox.h:55: error: expected ‘;’ before ‘<’ token
    showlist.h:7: error: extra qualification ‘Showlist::’ on member ‘Showlist’
    showlist.h:8: error: ‘QString’ has not been declared
    showlist.h:8: error: ‘QString’ has not been declared
    showlist.h:8: error: extra qualification ‘Showlist::’ on member ‘AddTiVo’
    showlist.h:9: error: ISO C++ forbids declaration of ‘QValueList’ with no type
    showlist.h:9: error: expected ‘;’ before ‘<’ token
    showlist.h:14: error: extra qualification ‘Showlist::’ on member ‘CheckFile’
    showlist.h:14: error: expected ‘;’ before ‘(’ token
    showlist.h:15: error: ISO C++ forbids declaration of ‘QValueList’ with no type
    showlist.h:15: error: expected ‘;’ before ‘<’ token
    main.cpp: In function ‘int mythplugin_init(const char*)’:
    main.cpp:34: error: ‘gContext’ was not declared in this scope
    main.cpp:35: error: ‘MYTH_BINARY_VERSION’ was not declared in this scope
    main.cpp: At global scope:
    main.cpp:40: error: ‘MythMainWindow’ has not been declared
    main.cpp: In function ‘int mythplugin_run()’:
    main.cpp:54: error: incomplete type ‘QSqlDatabase’ used in nested name specifier
    main.cpp:54: error: ‘gContext’ was not declared in this scope
    main.cpp: At global scope:
    main.cpp:86: error: ‘QValueList’ has not been declared
    main.cpp:86: error: expected ‘,’ or ‘...’ before ‘<’ token
    main.cpp: In function ‘void startDatabaseTree(QSqlDatabase*, int)’:
    main.cpp:88: error: ‘showlist’ was not declared in this scope
    main.cpp:88: error: ‘gContext’ was not declared in this scope
    main.cpp:90: error: ‘qApp’ was not declared in this scope
    main.cpp:92: error: ‘class DatabaseBox’ has no member named ‘exec’
    main.cpp: At global scope:
    main.cpp:96: error: ‘MythMainWindow’ has not been declared
    main.cpp: In function ‘int mythtivo_main(QSqlDatabase*, int*, const char*)’:
    main.cpp:103: error: ‘gContext’ was not declared in this scope
    main.cpp:105: error: ‘QString’ was not declared in this scope
    main.cpp:105: error: expected `;' before ‘whichTivo’
    main.cpp:106: error: expected `;' before ‘tivoParms’
    main.cpp:107: error: expected `;' before ‘tivoName’
    main.cpp:108: error: expected `;' before ‘tivoIpaddress’
    main.cpp:109: error: expected `;' before ‘tmp’
    main.cpp:112: error: expected `;' before ‘nada’
    main.cpp:116: error: ‘QValueList’ was not declared in this scope
    main.cpp:116: error: expected primary-expression before ‘>’ token
    main.cpp:116: error: ‘tivolist’ was not declared in this scope
    main.cpp:117: error: expected primary-expression before ‘>’ token
    main.cpp:117: error: ‘showlist’ was not declared in this scope
    main.cpp:127: error: ‘whichTivo’ was not declared in this scope
    main.cpp:128: error: ‘tivoParms’ was not declared in this scope
    main.cpp:136: error: ‘tivoName’ was not declared in this scope
    main.cpp:137: error: ‘tmp’ was not declared in this scope
    main.cpp:138: error: ‘tivoIpaddress’ was not declared in this scope
    main.cpp:144: error: ‘class Showlist’ has no member named ‘GetNowShowingList’
    main.cpp:151: error: ‘whichTivo’ was not declared in this scope
    main.cpp:152: error: ‘tivoParms’ was not declared in this scope
    main.cpp:159: error: ‘tivoName’ was not declared in this scope
    main.cpp:160: error: ‘tmp’ was not declared in this scope
    main.cpp:161: error: ‘tivoIpaddress’ was not declared in this scope
    main.cpp:165: error: ‘nada’ was not declared in this scope
    main.cpp: At global scope:
    main.cpp:97: warning: unused parameter ‘parent’
    main.cpp:97: warning: unused parameter ‘name’
    make[1]: *** [main.o] Error 1
    make[1]: Leaving directory `/home/mythtv/mythtivo/mythtivo'
    make: *** [sub-mythtivo] Error 2
    5 Hughes Dtivo all running 6.2 and hacked

  9. #24
    Join Date
    Oct 2004
    Posts
    87
    Quote Originally Posted by snake98 View Post
    I'm using ubuntu and myth .20, but I get an error when compling
    Error processing project file: /home/myth/Desktop/mythtivo/mythvideo/mythvideo.pro

    Could you point me in the right direction I installed mythvideo but have not tested it yet, but I did install mythvideo which was already compiled.
    Okay I got it qmake working following Vegas Instructions, but now I'm getting
    main.cpp:20:31 erro: mythtv/themedmenu.h: No such file or direcotry

    and exits on
    make: *** [main.o] error 1

    Any ideas, I have unbunt 6.10 and mythtivo 20 that I compiled myself

  10. #25
    Join Date
    Oct 2004
    Posts
    87
    Quote Originally Posted by snake98 View Post
    Okay I got it qmake working following Vegas Instructions, but now I'm getting
    main.cpp:20:31 erro: mythtv/themedmenu.h: No such file or direcotry

    and exits on
    make: *** [main.o] error 1

    Any ideas, I have unbunt 6.10 and mythtivo 20 that I compiled myself
    Okay I got those errors fixed make making linked files to mythtv directory, now this is the error I get

    mythtv@mythtv-desktop:~/download/mythtivo/mythtivo$ make
    g++ -c -pipe -Wall -W -O3 -march=i586 -fomit-frame-pointer -D_REENTRANT -fPIC -D_GNU_SOURCE -DPREFIX=\"/usr/local\" -DQT_NO_DEBUG -DQT_THREAD_SUPPORT -DQT_PLUGIN -DQT_SHARED -DQT_TABLET_SUPPORT -I/usr/share/qt3/mkspecs/default -I. -I/usr/local/include -I/usr/include/qt3 -o main.o main.cpp
    /usr/include/qt3/qsqldatabase.h:63: warning: ‘class QSqlDriverCreatorBase’ has virtual functions but non-virtual destructor
    showlist.h:7: error: extra qualification ‘Showlist::’ on member ‘Showlist’
    showlist.h:8: error: extra qualification ‘Showlist::’ on member ‘AddTiVo’
    showlist.h:9: error: extra qualification ‘Showlist::’ on member ‘GetNowShowingList’
    showlist.h:14: error: extra qualification ‘Showlist::’ on member ‘CheckFile’
    main.cpp:97: warning: unused parameter ‘parent’
    main.cpp:97: warning: unused parameter ‘name’
    make: *** [main.o] Error 1

    Thanks for for any info
    Last edited by snake98; 01-16-2007 at 01:27 PM.

  11. #26
    Join Date
    Oct 2004
    Posts
    87
    Quote Originally Posted by snake98 View Post
    Okay I got those errors fixed make making linked files to mythtv directory, no this is the error I get

    showlist.h:7: error: extra qualification ‘Showlist::’ on member ‘Showlist’
    showlist.h:8: error: extra qualification ‘Showlist::’ on member ‘AddTiVo’
    showlist.h:9: error: extra qualification ‘Showlist::’ on member ‘GetNowShowingList’
    showlist.h:14: error: extra qualification ‘Showlist::’ on member ‘CheckFile’
    main.cpp:97: warning: unused parameter ‘parent’
    main.cpp:97: warning: unused parameter ‘name’
    make: *** [main.o] Error 1

    Thanks for for any info
    Fixed this by editing the showlist.h file, here is what mine looks like
    Code:
    #ifndef SHOWLIST_H_
    #define SHOWLIST_H_
    
    class Showlist
    {
      public:
        Showlist() {}
        void AddTiVo( QString &name, QString &ipaddress );
        QValueList<Metadata> GetNowShowingList()
        {
            return nowshowinglist;
        };
      private:
        Metadata * CheckFile(QString &filename);
        QValueList<Metadata> nowshowinglist;
    };
    
    #endif

  12. #27
    Join Date
    Oct 2004
    Posts
    87

    Exits when I click on the bedroom, or Familyroom tivo

    I got it compiled and installed, edit the mythtivo-settings, and can see the list when I click tivo. But when I click on either one myth exits out any ideas?

  13. #28
    Join Date
    Oct 2004
    Posts
    87
    Quote Originally Posted by snake98 View Post
    I got it compiled and installed, edit the mythtivo-settings, and can see the list when I click tivo. But when I click on either one myth exits out any ideas?

    I got it list the shows(vserver wasn't running), and mplayer works to watch a video, but when I click on a show to watch nothing happens, when hit space bar it turns red, but nothing happens anybody got any ideas?

  14. #29
    Join Date
    Oct 2004
    Posts
    87
    Quote Originally Posted by snake98 View Post
    I got it list the shows(vserver wasn't running), and mplayer works to watch a video, but when I click on a show to watch nothing happens, when hit space bar it turns red, but nothing happens anybody got any ideas?
    Okay I got it going, next time I need to read the insruction I had to get mplayer working with vstream support. and on Unbuntu 6.10 I had to add -ac ffmp3 and change -aop to -af and it work.

  15. #30
    Join Date
    Feb 2004
    Posts
    54

    work on this stopped for me.

    well i got home one day last week and found my mythtv server in an odd state.come to find out the cpu fan just stopped and burned the cpu out. so i'm out to get a new system this weekend and give it a try one more time.
    5 Hughes Dtivo all running 6.2 and hacked

Posting Permissions

  • You may not post new threads
  • You may not post replies
  • You may not post attachments
  • You may not edit your posts
  •